{"text_format":"1","workbook":"xlsx","n_sheets":7,"sheets":["Linear","Log","Exp","Square","SqRoot","Reciprocal","Controls"],"not_rendered":{"charts":18,"images":6,"macros":1,"external_links":0,"defined_names":0,"comments":0,"pivot_tables":0},"unopened":[],"bounds":{"document_bytes":16777216,"sheet_cells":100000,"rows_first":2000,"rows_last":500,"rows_between":2000,"halvings":0,"cell_chars":16384,"cell_head_chars":4096},"cells_cut":0,"cells_raw":0,"read":"whole","date_system":"1900"}

{"sheet":"Linear","index":0,"n_rows":32,"n_cols":6,"rows_kept":32,"cut":false,"hidden":false,"merged":[]}
["Parameter","Value",null,null,null,"Equation of Function"]
["a",{"$f":"Controls!B2+Controls!B4*(Controls!B3-Controls!B2)/200","v":-2},null,null,null,{"$f":"IF(B2<>0,CONCATENATE(\"y = \",B2,\"x\"),\"y = 0\")","v":"y = -2x"}]
["k",{"$f":"Controls!C2+Controls!C4*(Controls!C3-Controls!C2)/200","v":-5},null,null,null,{"$f":"IF(B3>0,CONCATENATE(\"y = x + \",B3),IF(B3=0,\"y = x\",CONCATENATE(\"y = x - \",ABS(B3))))","v":"y = x - 5"}]
["h",{"$f":"Controls!D2+Controls!D4*(Controls!D3-Controls!D2)/200","v":-5},null,null,null,{"$f":"IF(B4>0,CONCATENATE(\"y = x - \",B4),IF(B4=0,\"y = x\",CONCATENATE(\"y = x + \",ABS(B4))))","v":"y = x + 5"}]
[]
["x","y = f(x)","y = f(x-k)","y = f(x) + h","y = af(x)"]
[-5,{"$f":"A7","v":-5},{"$f":"(A7-$B$4)","v":0},{"$f":"A7+$B$3","v":-10},{"$f":"A7*$B$2","v":10}]
[-4,{"$f":"A8","v":-4},{"$f":"(A8-$B$4)","v":1},{"$f":"A8+$B$3","v":-9},{"$f":"A8*$B$2","v":8}]
[-3,-3,2,-8,6]
[-2,-2,3,-7,4]
[-1,-1,4,-6,2]
[0,0,5,-5,0]
[1,1,6,-4,-2]
[2,2,7,-3,-4]
[3,3,8,-2,-6]
[4,4,9,-1,-8]
[5,5,10,0,-10]
[6,6,11,1,-12]
[7,7,12,2,-14]
[8,8,13,3,-16]
[9,9,14,4,-18]
[10,10,15,5,-20]
[11,11,16,6,-22]
[12,12,17,7,-24]
[13,13,18,8,-26]
[14,14,19,9,-28]
[15,15,20,10,-30]
[16,16,21,11,-32]
[17,17,22,12,-34]
[18,18,23,13,-36]
[19,19,24,14,-38]
[20,20,25,15,-40]

{"sheet":"Log","index":1,"n_rows":26,"n_cols":6,"rows_kept":26,"cut":false,"hidden":false,"merged":[]}
["Parameter","Value",null,null,null,"Equation of Function"]
["a",{"$f":"Controls!B7+Controls!B9*(Controls!B8-Controls!B7)/200","v":-2},null,null,null,{"$f":"IF(B2<>0,CONCATENATE(\"y = \",B2,\"ln(x)\"),\"y = 0\")","v":"y = -2ln(x)"}]
["k",{"$f":"Controls!C7+Controls!C9*(Controls!C8-Controls!C7)/200","v":-5},null,null,null,{"$f":"IF(B3>0,CONCATENATE(\"y = ln(x) + \",B3),IF(B3=0,\"y = ln(x)\",CONCATENATE(\"y = ln(x) - \",ABS(B3))))","v":"y = ln(x) - 5"}]
["h",{"$f":"Controls!D7+Controls!D9*(Controls!D8-Controls!D7)/200","v":-5},null,null,null,{"$f":"IF(B4>0,CONCATENATE(\"y = ln(x - \",B4,\")\"),IF(B4=0,\"y = ln(x)\",CONCATENATE(\"y = ln(x + \",ABS(B4),\")\")))","v":"y = ln(x + 5)"}]
[]
["x","y = f(x)","y = f(x-k)","y = f(x) + h","y = af(x)"]
[1,{"$f":"LN(A7)","v":0},{"$f":"LN(A7-$B$4)","v":1.791759469228055},{"$f":"LN(A7)+$B$3","v":-5},{"$f":"$B$2*LN(A7)","v":0}]
[2,{"$f":"LN(A8)","v":0.69314718055994529},{"$f":"LN(A8-$B$4)","v":1.9459101490553132},{"$f":"LN(A8)+$B$3","v":-4.3068528194400546},{"$f":"$B$2*LN(A8)","v":-1.3862943611198906}]
[3,1.0986122886681098,2.0794415416798357,-3.90138771133189,-2.1972245773362196]
[4,1.3862943611198906,2.1972245773362196,-3.6137056388801092,-2.7725887222397811]
[5,1.6094379124341003,2.3025850929940459,-3.3905620875658995,-3.2188758248682006]
[6,1.791759469228055,2.3978952727983707,-3.208240530771945,-3.5835189384561099]
[7,1.9459101490553132,2.4849066497880004,-3.0540898509446865,-3.8918202981106265]
[8,2.0794415416798357,2.5649493574615367,-2.9205584583201643,-4.1588830833596715]
[9,2.1972245773362196,2.6390573296152584,-2.8027754226637804,-4.3944491546724391]
[10,2.3025850929940459,2.7080502011022101,-2.6974149070059541,-4.6051701859880918]
[11,2.3978952727983707,2.7725887222397811,-2.6021047272016293,-4.7957905455967413]
[12,2.4849066497880004,2.8332133440562162,-2.5150933502119996,-4.9698132995760007]
[13,2.5649493574615367,2.8903717578961645,-2.4350506425384633,-5.1298987149230735]
[14,2.6390573296152584,2.9444389791664403,-2.3609426703847416,-5.2781146592305168]
[15,2.7080502011022101,2.9957322735539909,-2.2919497988977899,-5.4161004022044201]
[16,2.7725887222397811,3.044522437723423,-2.2274112777602189,-5.5451774444795623]
[17,2.8332133440562162,3.0910424533583161,-2.1667866559437838,-5.6664266881124323]
[18,2.8903717578961645,3.1354942159291497,-2.1096282421038355,-5.780743515792329]
[19,2.9444389791664403,3.1780538303479458,-2.0555610208335597,-5.8888779583328805]
[20,2.9957322735539909,3.2188758248682006,-2.0042677264460091,-5.9914645471079817]

{"sheet":"Exp","index":2,"n_rows":37,"n_cols":6,"rows_kept":37,"cut":false,"hidden":false,"merged":[]}
["Parameter","Value",null,null,null,"Equation of Function"]
["a",{"$f":"Controls!B12+Controls!B14*(Controls!B13-Controls!B12)/200","v":-2},null,null,null,{"$f":"IF(B2<>0,CONCATENATE(\"y = \",B2,\"exp(x)\"),\"y = 0\")","v":"y = -2exp(x)"}]
["k",{"$f":"Controls!C12+Controls!C14*(Controls!C13-Controls!C12)/200","v":-5},null,null,null,{"$f":"IF(B3>0,CONCATENATE(\"y = exp(x) + \",B3),IF(B3=0,\"y = exp(x)\",CONCATENATE(\"y = exp(x) - \",ABS(B3))))","v":"y = exp(x) - 5"}]
["h",{"$f":"Controls!D12+Controls!D14*(Controls!D13-Controls!D12)/200","v":-5},null,null,null,{"$f":"IF(B4>0,CONCATENATE(\"y = exp(x - \",B4,\")\"),IF(B4=0,\"y = exp(x)\",CONCATENATE(\"y = exp(x + \",ABS(B4),\")\")))","v":"y = exp(x + 5)"}]
[]
["x","y = f(x)","y = f(x-k)","y = f(x) + h","y = af(x)"]
[-2.5,{"$f":"EXP(A7)","v":8.20849986238988E-2},{"$f":"EXP(A7-$B$4)","v":12.182493960703473},{"$f":"EXP(A7)+$B$3","v":-4.9179150013761008},{"$f":"$B$2*EXP(A7)","v":-0.1641699972477976}]
[-2.25,{"$f":"EXP(A8)","v":0.10539922456186433},{"$f":"EXP(A8-$B$4)","v":15.642631884188171},{"$f":"EXP(A8)+$B$3","v":-4.8946007754381355},{"$f":"$B$2*EXP(A8)","v":-0.21079844912372867}]
[-2,0.1353352832366127,20.085536923187668,-4.8646647167633876,-0.2706705664732254]
[-1.75,0.17377394345044514,25.790339917193062,-4.8262260565495545,-0.34754788690089028]
[-1.5,0.22313016014842982,33.115451958692312,-4.7768698398515701,-0.44626032029685964]
[-1.25,0.28650479686019009,42.521082000062783,-4.7134952031398099,-0.57300959372038018]
[-1,0.36787944117144233,54.598150033144236,-4.6321205588285572,-0.73575888234288467]
[-0.75,0.47236655274101469,70.105412346687856,-4.5276334472589852,-0.94473310548202938]
[-0.5,0.60653065971263342,90.017131300521811,-4.3934693402873668,-1.2130613194252668]
[-0.25,0.77880078307140488,115.58428452718766,-4.2211992169285955,-1.5576015661428098]
[0,1,148.4131591025766,-4,-2]
[0.25,1.2840254166877414,190.56626845862999,-3.7159745833122586,-2.5680508333754828]
[0.5,1.6487212707001282,244.69193226422038,-3.3512787292998718,-3.2974425414002564]
[0.75,2.1170000166126748,314.19066028569421,-2.8829999833873252,-4.2340000332253496]
[1,2.7182818284590451,403.42879349273511,-2.2817181715409549,-5.4365636569180902]
[1.25,3.4903429574618414,518.01282466834198,-1.5096570425381586,-6.9806859149236828]
[1.5,4.4816890703380645,665.14163304436181,-0.51831092966193548,-8.963378140676129]
[1.75,5.7546026760057307,854.05876252615155,0.75460267600573072,-11.509205352011461]
[2,7.3890560989306504,1096.6331584284585,2.3890560989306504,-14.778112197861301]
[2.25,9.4877358363585262,1408.1048482046956,4.4877358363585262,-18.975471672717052]
[2.5,12.182493960703473,1808.0424144560632,7.1824939607034732,-24.364987921406946]
[2.75,15.642631884188171,2321.572414611057,10.642631884188171,-31.285263768376343]
[3,20.085536923187668,2980.9579870417283,15.085536923187668,-40.171073846375336]
[3.25,25.790339917193062,3827.6258214399063,20.790339917193062,-51.580679834386125]
[3.5,33.115451958692312,4914.7688402991344,28.115451958692312,-66.230903917384623]
[3.75,42.521082000062783,6310.6881080890244,37.521082000062783,-85.042164000125567]
[4,54.598150033144236,8103.0839275753842,49.598150033144236,-109.19630006628847]
[4.25,70.105412346687856,10404.565716560723,65.105412346687856,-140.21082469337571]
[4.5,90.017131300521811,13359.726829661873,85.017131300521811,-180.03426260104362]
[4.75,115.58428452718766,17154.228809290984,110.58428452718766,-231.16856905437533]
[5,148.4131591025766,22026.465794806718,143.4131591025766,-296.8263182051532]

{"sheet":"Square","index":3,"n_rows":32,"n_cols":6,"rows_kept":32,"cut":false,"hidden":false,"merged":[]}
["Parameter","Value",null,null,null,"Equation of Function"]
["a",{"$f":"Controls!B17+Controls!B19*(Controls!B18-Controls!B17)/200","v":-2},null,null,null,{"$f":"IF(B2<>0,CONCATENATE(\"y = \",B2,\"x^2\"),\"y = 0\")","v":"y = -2x^2"}]
["k",{"$f":"Controls!C17+Controls!C19*(Controls!C18-Controls!C17)/200","v":-50},null,null,null,{"$f":"IF(B3>0,CONCATENATE(\"y = x^2 + \",B3),IF(B3=0,\"y = x^2\",CONCATENATE(\"y = x^2 - \",ABS(B3))))","v":"y = x^2 - 50"}]
["h",{"$f":"Controls!D17+Controls!D19*(Controls!D18-Controls!D17)/200","v":-5},null,null,null,{"$f":"IF(B4>0,CONCATENATE(\"y = (x - \",B4,\")^2\"),IF(B4=0,\"y = x^2\",CONCATENATE(\"y = (x + \",ABS(B4),\")^2\")))","v":"y = (x + 5)^2"}]
[]
["x","y = f(x)","y = f(x-k)","y = f(x) + h","y = af(x)"]
[-10,{"$f":"A7^2","v":100},{"$f":"(A7-$B$4)^2","v":25},{"$f":"A7^2+$B$3","v":50},{"$f":"$B$2*A7^2","v":-200}]
[-9,{"$f":"A8^2","v":81},{"$f":"(A8-$B$4)^2","v":16},{"$f":"A8^2+$B$3","v":31},{"$f":"$B$2*A8^2","v":-162}]
[-8,64,9,14,-128]
[-7,49,4,-1,-98]
[-6,36,1,-14,-72]
[-5,25,0,-25,-50]
[-4,16,1,-34,-32]
[-3,9,4,-41,-18]
[-2,4,9,-46,-8]
[-1,1,16,-49,-2]
[0,0,25,-50,0]
[1,1,36,-49,-2]
[2,4,49,-46,-8]
[3,9,64,-41,-18]
[4,16,81,-34,-32]
[5,25,100,-25,-50]
[6,36,121,-14,-72]
[7,49,144,-1,-98]
[8,64,169,14,-128]
[9,81,196,31,-162]
[10,100,225,50,-200]
[11,121,256,71,-242]
[12,144,289,94,-288]
[13,169,324,119,-338]
[14,196,361,146,-392]
[15,225,400,175,-450]

{"sheet":"SqRoot","index":4,"n_rows":32,"n_cols":6,"rows_kept":32,"cut":false,"hidden":false,"merged":[]}
["Parameter","Value",null,null,null,"Equation of Function"]
["a",{"$f":"Controls!B22+Controls!B24*(Controls!B23-Controls!B22)/200","v":-2},null,null,null,{"$f":"IF(B2<>0,CONCATENATE(\"y = \",B2,\"sqrt(x)\"),\"y = 0\")","v":"y = -2sqrt(x)"}]
["k",{"$f":"Controls!C22+Controls!C24*(Controls!C23-Controls!C22)/200","v":-5},null,null,null,{"$f":"IF(B3>0,CONCATENATE(\"y = sqrt(x) + \",B3),IF(B3=0,\"y = sqrt(x)\",CONCATENATE(\"y = sqrt(x) - \",ABS(B3))))","v":"y = sqrt(x) - 5"}]
["h",{"$f":"Controls!D22+Controls!D24*(Controls!D23-Controls!D22)/200","v":-5},null,null,null,{"$f":"IF(B4>0,CONCATENATE(\"y = sqrt(x - \",B4,\")\"),IF(B4=0,\"y = sqrt(x)\",CONCATENATE(\"y = sqrt(x + \",ABS(B4),\")\")))","v":"y = sqrt(x + 5)"}]
[]
["x","y = f(x)","y = f(x-k)","y = f(x) + h","y = af(x)"]
[0,{"$f":"SQRT(A7)","v":0},{"$f":"SQRT(A7-$B$4)","v":2.2360679774997898},{"$f":"SQRT(A7)+$B$3","v":-5},{"$f":"$B$2*SQRT(A7)","v":0}]
[1,{"$f":"SQRT(A8)","v":1},{"$f":"SQRT(A8-$B$4)","v":2.4494897427831779},{"$f":"SQRT(A8)+$B$3","v":-4},{"$f":"$B$2*SQRT(A8)","v":-2}]
[2,1.4142135623730951,2.6457513110645907,-3.5857864376269051,-2.8284271247461903]
[3,1.7320508075688772,2.8284271247461903,-3.2679491924311228,-3.4641016151377544]
[4,2,3,-3,-4]
[5,2.2360679774997898,3.1622776601683795,-2.7639320225002102,-4.4721359549995796]
[6,2.4494897427831779,3.3166247903553998,-2.5505102572168221,-4.8989794855663558]
[7,2.6457513110645907,3.4641016151377544,-2.3542486889354093,-5.2915026221291814]
[8,2.8284271247461903,3.6055512754639891,-2.1715728752538097,-5.6568542494923806]
[9,3,3.7416573867739413,-2,-6]
[10,3.1622776601683795,3.872983346207417,-1.8377223398316205,-6.324555320336759]
[11,3.3166247903553998,4,-1.6833752096446002,-6.6332495807107996]
[12,3.4641016151377544,4.1231056256176606,-1.5358983848622456,-6.9282032302755088]
[13,3.6055512754639891,4.2426406871192848,-1.3944487245360109,-7.2111025509279782]
[14,3.7416573867739413,4.358898943540674,-1.2583426132260587,-7.4833147735478827]
[15,3.872983346207417,4.4721359549995796,-1.127016653792583,-7.745966692414834]
[16,4,4.5825756949558398,-1,-8]
[17,4.1231056256176606,4.6904157598234297,-0.87689437438233941,-8.2462112512353212]
[18,4.2426406871192848,4.7958315233127191,-0.75735931288071523,-8.4852813742385695]
[19,4.358898943540674,4.8989794855663558,-0.64110105645932602,-8.717797887081348]
[20,4.4721359549995796,5,-0.52786404500042039,-8.9442719099991592]
[21,4.5825756949558398,5.0990195135927845,-0.41742430504416017,-9.1651513899116797]
[22,4.6904157598234297,5.196152422706632,-0.30958424017657027,-9.3808315196468595]
[23,4.7958315233127191,5.2915026221291814,-0.20416847668728089,-9.5916630466254382]
[24,4.8989794855663558,5.3851648071345037,-0.10102051443364424,-9.7979589711327115]
[25,5,5.4772255750516612,0,-10]

{"sheet":"Reciprocal","index":5,"n_rows":31,"n_cols":6,"rows_kept":31,"cut":false,"hidden":false,"merged":[]}
["Parameter","Value",null,null,null,"Equation of Function"]
["a",{"$f":"Controls!B27+Controls!B29*(Controls!B28-Controls!B27)/200","v":-2},null,null,null,{"$f":"IF(B2<>0,CONCATENATE(\"y = \",B2,\"/x\"),\"y = 0\")","v":"y = -2/x"}]
["k",{"$f":"Controls!C27+Controls!C29*(Controls!C28-Controls!C27)/200","v":-5},null,null,null,{"$f":"IF(B3>0,CONCATENATE(\"y = (1/x) + \",B3),IF(B3=0,\"y = (1/x)\",CONCATENATE(\"y = (1/x) - \",ABS(B3))))","v":"y = (1/x) - 5"}]
["h",{"$f":"Controls!D27+Controls!D29*(Controls!D28-Controls!D27)/200","v":5},null,null,null,{"$f":"IF(B4>0,CONCATENATE(\"y = 1/(x - \",B4,\")\"),IF(B4=0,\"y = 1/x\",CONCATENATE(\"y = 1/(x + \",ABS(B4),\")\")))","v":"y = 1/(x - 5)"}]
[]
["x","y = f(x)","y = f(x-k)","y = f(x) + h","y = af(x)"]
[0.25,{"$f":"1/A7","v":4},{"$f":"1/(A7-$B$4)","v":-0.21052631578947367},{"$f":"1/A7+$B$3","v":-1},{"$f":"$B$2/A7","v":-8}]
[0.75,{"$f":"1/A8","v":1.3333333333333333},{"$f":"1/(A8-$B$4)","v":-0.23529411764705882},{"$f":"1/A8+$B$3","v":-3.666666666666667},{"$f":"$B$2/A8","v":-2.6666666666666665}]
[1.25,0.8,-0.26666666666666666,-4.2,-1.6]
[1.75,0.5714285714285714,-0.30769230769230771,-4.4285714285714288,-1.1428571428571428]
[2.25,0.44444444444444442,-0.36363636363636365,-4.5555555555555554,-0.88888888888888884]
[2.75,0.36363636363636365,-0.44444444444444442,-4.6363636363636367,-0.72727272727272729]
[3.25,0.30769230769230771,-0.5714285714285714,-4.6923076923076925,-0.61538461538461542]
[3.75,0.26666666666666666,-0.8,-4.7333333333333334,-0.53333333333333333]
[4.25,0.23529411764705882,-1.3333333333333333,-4.7647058823529411,-0.47058823529411764]
[4.75,0.21052631578947367,-4,-4.7894736842105265,-0.42105263157894735]
[5.25,0.19047619047619047,4,-4.8095238095238093,-0.38095238095238093]
[5.75,0.17391304347826086,1.3333333333333333,-4.8260869565217392,-0.34782608695652173]
[6.25,0.16,0.8,-4.84,-0.32]
[6.75,0.14814814814814814,0.5714285714285714,-4.8518518518518521,-0.29629629629629628]
[7.25,0.13793103448275862,0.44444444444444442,-4.8620689655172411,-0.27586206896551724]
[7.75,0.12903225806451613,0.36363636363636365,-4.870967741935484,-0.25806451612903225]
[8.25,0.12121212121212122,0.30769230769230771,-4.8787878787878789,-0.24242424242424243]
[8.75,0.11428571428571428,0.26666666666666666,-4.8857142857142861,-0.22857142857142856]
[9.25,0.10810810810810811,0.23529411764705882,-4.8918918918918921,-0.21621621621621623]
[9.75,0.10256410256410256,0.21052631578947367,-4.8974358974358978,-0.20512820512820512]
[10.25,9.7560975609756101E-2,0.19047619047619047,-4.9024390243902438,-0.1951219512195122]
[10.75,9.3023255813953487E-2,0.17391304347826086,-4.9069767441860463,-0.18604651162790697]
[11.25,8.8888888888888892E-2,0.16,-4.9111111111111114,-0.17777777777777778]
[11.75,8.5106382978723402E-2,0.14814814814814814,-4.9148936170212769,-0.1702127659574468]
[12.25,8.1632653061224483E-2,0.13793103448275862,-4.9183673469387754,-0.16326530612244897]

{"sheet":"Controls","index":6,"n_rows":29,"n_cols":4,"rows_kept":29,"cut":false,"hidden":true,"merged":[]}
["Linear","a","h","k"]
["Min",-2,-5,-5]
["Max",2,5,5]
["Reading",0,0,0]
[]
["Log","a","h","k"]
["Min",-2,-5,-5]
["Max",2,5,5]
["Reading",0,0,0]
[]
["Exp","a","h","k"]
["Min",-2,-5,-5]
["Max",2,5,5]
["Reading",0,0,0]
[]
["Square","a","h","k"]
["Min",-2,-50,-5]
["Max",2,50,5]
["Reading",0,0,0]
[]
["Sq Root","a","h","k"]
["Min",-2,-5,-5]
["Max",2,5,5]
["Reading",0,0,0]
[]
["Reciprocal","a","h","k"]
["Min",-2,-5,-5]
["Max",2,5,5]
["Reading",0,0,200]